bend-n
type: LexicalEntry
canonical form: bend
sense: 02833197-n
part of speech: noun

bend dexter-n
type: LexicalEntry
canonical form: bend dexter
sense: 02833197-n
part of speech: noun

02833197-n
type: LexicalConcept
in scheme: en-word.net
definition: diagonal line traversing a shield from the upper right corner to the lower left
ili: i50705
lexfile: noun.artifact
part of speech: noun
hypernym: 03859254-n