bazaar-n
type: LexicalEntry
canonical form: bazaar
sense: 02816679-n
part of speech: noun

bazar-n
type: LexicalEntry
canonical form: bazar
sense: 02816679-n
part of speech: noun

02816679-n
type: LexicalConcept
in scheme: en-word.net
definition: a shop where a variety of goods are sold
ili: i50598
lexfile: noun.artifact
part of speech: noun
hypernym: 04209460-n