basin-n
type: LexicalEntry
canonical form: basin
sense: 02804691-n
part of speech: noun

02804691-n
type: LexicalConcept
in scheme: en-word.net
definition: a bowl-shaped vessel; usually used for holding food or liquids
example: she mixed the dough in a large basin
ili: i50520
lexfile: noun.artifact
part of speech: noun
hypernym: 04538393-n