barn-n
type: LexicalEntry
canonical form: barn
sense: 02796518-n
part of speech: noun

02796518-n
type: LexicalConcept
in scheme: en-word.net
definition: an outlying farm building for storing grain or animal feed and housing farm animals
ili: i50475
lexfile: noun.artifact
part of speech: noun
hypernym: 03327515-n
mero part: 03505701-n