barb-n
type: LexicalEntry
canonical form: barb
sense: 02793345-n
part of speech: noun

02793345-n
type: LexicalConcept
in scheme: en-word.net
definition: a subsidiary point facing opposite from the main point that makes an arrowhead or spear hard to remove
ili: i50453
lexfile: noun.artifact
part of speech: noun
hypernym: 03980573-n