suck-v
type: LexicalEntry
canonical form: suck
sense: 02771650-v
part of speech: verb

suck in-v
type: LexicalEntry
canonical form: suck in
sense: 02771650-v
part of speech: verb

02771650-v
type: LexicalConcept
in scheme: en-word.net
definition: attract by using an inexorable force, inducement, etc.
example: The current boom in the economy sucked many workers in from abroad
ili: i35509
lexfile: verb.weather
part of speech: verb
hypernym: 02771422-v