shine-v
type: LexicalEntry
canonical form: shine
sense: 02769698-v
part of speech: verb

beam-v
type: LexicalEntry
canonical form: beam
sense: 02769698-v
part of speech: verb

02769698-v
type: LexicalConcept
in scheme: en-word.net
definition: emit light; be bright, as of the sun or a light
example: The sun shone bright that day
example: The fire beamed on their faces
ili: i35500
lexfile: verb.weather
part of speech: verb
hypernym: 02773266-v