automation-n
type: LexicalEntry
canonical form: automation
sense: 02764211-n
part of speech: noun

02764211-n
type: LexicalConcept
in scheme: en-word.net
definition: equipment used to achieve automatic control or operation
example: this factory floor is a showcase for automation and robotic equipment
ili: i50282
lexfile: noun.artifact
part of speech: noun
hypernym: 03298959-n