count-v
type: LexicalEntry
canonical form: count
sense: 02753015-v
part of speech: verb

02753015-v
type: LexicalConcept
in scheme: en-word.net
definition: have a certain value or carry a certain weight
example: each answer counts as three points
ili: i35410
lexfile: verb.stative
part of speech: verb
hypernym: 02609706-v