assembly-n
type: LexicalEntry
canonical form: assembly
sense: 02752958-n
part of speech: noun

02752958-n
type: LexicalConcept
in scheme: en-word.net
definition: a unit consisting of components that have been fitted together
ili: i50216
lexfile: noun.artifact
part of speech: noun
hypernym: 00003553-n