test-v
type: LexicalEntry
canonical form: test
sense: 02751588-v
part of speech: verb

02751588-v
type: LexicalConcept
in scheme: en-word.net
definition: show a certain characteristic when tested
example: He tested positive for HIV
ili: i35402
lexfile: verb.stative
part of speech: verb
hypernym: 02141597-v