artist's loft-n
type: LexicalEntry
canonical form: artist's loft
sense: 02749688-n
part of speech: noun

02749688-n
type: LexicalConcept
in scheme: en-word.net
definition: a factory loft that has been converted into an artist's workroom and living area
ili: i50196
lexfile: noun.artifact
part of speech: noun
hypernym: 03691796-n
hypernym: 02749846-n