armature-n
type: LexicalEntry
canonical form: armature
sense: 02741276-n
part of speech: noun

02741276-n
type: LexicalConcept
in scheme: en-word.net
definition: coil in which voltage is induced by motion through a magnetic field
ili: i50148
lexfile: noun.artifact
part of speech: noun
hypernym: 03069712-n