archive-n
type: LexicalEntry
canonical form: archive
sense: 02738091-n
part of speech: noun

02738091-n
type: LexicalConcept
in scheme: en-word.net
definition: a depository containing historical records and documents
ili: i50132
lexfile: noun.artifact
part of speech: noun
hypernym: 03182015-n