lie-v
type: LexicalEntry
canonical form: lie
sense: 02737265-v
part of speech: verb

rest-v
type: LexicalEntry
canonical form: rest
sense: 02737265-v
part of speech: verb

02737265-v
type: LexicalConcept
in scheme: en-word.net
definition: have a place in relation to something else
example: The fate of Bosnia lies in the hands of the West
example: The responsibility rests with the Allies
ili: i35322
lexfile: verb.stative
part of speech: verb
hypernym: 02661230-v
similar: 02696550-v