arch-n
type: LexicalEntry
canonical form: arch
sense: 02737222-n
part of speech: noun

archway-n
type: LexicalEntry
canonical form: archway
sense: 02737222-n
part of speech: noun

02737222-n
type: LexicalConcept
in scheme: en-word.net
definition: a passageway under a curved masonry construction
example: they built a triumphal arch to memorialize their victory
ili: i50127
lexfile: noun.artifact
part of speech: noun
hypernym: 03295682-n