cloister-v
type: LexicalEntry
canonical form: cloister
sense: 02730001-v
part of speech: verb

02730001-v
type: LexicalConcept
in scheme: en-word.net
definition: surround with a cloister, as of a garden
ili: i35286
lexfile: verb.stative
part of speech: verb
hypernym: 01469999-v