elude-v
type: LexicalEntry
canonical form: elude
sense: 02729107-v
part of speech: verb

escape-v
type: LexicalEntry
canonical form: escape
sense: 02729107-v
part of speech: verb

02729107-v
type: LexicalConcept
in scheme: en-word.net
definition: be incomprehensible to; escape understanding by
example: What you are seeing in him eludes me
ili: i35281
lexfile: verb.stative
part of speech: verb
hypernym: 00624056-v