sojourn-v
type: LexicalEntry
canonical form: sojourn
sense: 02715296-v
part of speech: verb

02715296-v
type: LexicalConcept
in scheme: en-word.net
definition: spend a certain length of time; reside temporarily
ili: i35208
lexfile: verb.stative
part of speech: verb
hypernym: 02714280-v