anchor-n
type: LexicalEntry
canonical form: anchor
sense: 02712226-n
part of speech: noun

ground tackle-n
type: LexicalEntry
canonical form: ground tackle
sense: 02712226-n
part of speech: noun

02712226-n
type: LexicalConcept
in scheme: en-word.net
definition: a mechanical device that prevents a vessel from moving
ili: i50003
lexfile: noun.artifact
part of speech: noun
hypernym: 03537852-n
mero part: 03374486-n
mero part: 04191138-n