subtend-v
type: LexicalEntry
canonical form: subtend
sense: 02699684-v
part of speech: verb

delimit-v
type: LexicalEntry
canonical form: delimit
sense: 02699684-v
part of speech: verb

02699684-v
type: LexicalConcept
in scheme: en-word.net
definition: be opposite to; of angles and sides, in geometry
ili: i35124
lexfile: verb.stative
part of speech: verb
hypernym: 02672590-v