lie-v
type: LexicalEntry
canonical form: lie
sense: 02696550-v
part of speech: verb

02696550-v
type: LexicalConcept
in scheme: en-word.net
definition: be located or situated somewhere; occupy a certain position
ili: i35108
lexfile: verb.stative
part of speech: verb
hypernym: 02661230-v
similar: 02737265-v