preserve-v
type: LexicalEntry
canonical form: preserve
sense: 02688596-v
part of speech: verb

02688596-v
type: LexicalConcept
in scheme: en-word.net
definition: keep undisturbed for personal or private use for hunting, shooting, or fishing
example: preserve the forest and the lakes
ili: i35069
lexfile: verb.stative
part of speech: verb
hypernym: 02687605-v