implicate-v
type: LexicalEntry
canonical form: implicate
sense: 02683142-v
part of speech: verb

02683142-v
type: LexicalConcept
in scheme: en-word.net
definition: bring into intimate and incriminating connection
example: He is implicated in the scheme to defraud the government
ili: i35047
lexfile: verb.stative
part of speech: verb
hypernym: 02682907-v