boggle-v
type: LexicalEntry
canonical form: boggle
sense: 02646395-v
part of speech: verb

02646395-v
type: LexicalConcept
in scheme: en-word.net
definition: hesitate when confronted with a problem, or when in doubt or fear
ili: i34872
lexfile: verb.stative
part of speech: verb
hypernym: 02646524-v