wait-v
type: LexicalEntry
canonical form: wait
sense: 02644022-v
part of speech: verb

02644022-v
type: LexicalConcept
in scheme: en-word.net
definition: stay in one place and anticipate or expect something
example: I had to wait on line for an hour to get the tickets
ili: i34861
lexfile: verb.stative
part of speech: verb
hypernym: 00721987-v
hypernym: 01861378-v