result-v
type: LexicalEntry
canonical form: result
sense: 02640346-v
part of speech: verb

ensue-v
type: LexicalEntry
canonical form: ensue
sense: 02640346-v
part of speech: verb

02640346-v
type: LexicalConcept
in scheme: en-word.net
definition: issue or terminate (in a specified way, state, etc.); end
example: result in tragedy
ili: i34843
lexfile: verb.stative
part of speech: verb
hypernym: 02639962-v