stem-v
type: LexicalEntry
canonical form: stem
sense: 02633834-v
part of speech: verb

02633834-v
type: LexicalConcept
in scheme: en-word.net
definition: grow out of, have roots in, originate in
example: The increase in the national debt stems from the last war
ili: i34812
lexfile: verb.stative
part of speech: verb
hypernym: 02633747-v