bead-v
type: LexicalEntry
canonical form: bead
sense: 02631602-v
part of speech: verb

02631602-v
type: LexicalConcept
in scheme: en-word.net
definition: form into beads, as of water or sweat, for example
ili: i34799
lexfile: verb.stative
part of speech: verb
hypernym: 00144670-v