begin-v
type: LexicalEntry
canonical form: begin
sense: 02614382-v
part of speech: verb

start-v
type: LexicalEntry
canonical form: start
sense: 02614382-v
part of speech: verb

02614382-v
type: LexicalConcept
in scheme: en-word.net
definition: have a beginning, in a temporal, spatial, or evaluative sense
example: The DMZ begins right over the hill
example: The second movement begins after the Allegro
example: Prices for these homes start at $250,000
ili: i34719
lexfile: verb.stative
part of speech: verb
hypernym: 00109468-v
similar: 02614858-v
similar: 02615238-v