use-v
type: LexicalEntry
canonical form: use
sense: 02606487-v
part of speech: verb

02606487-v
type: LexicalConcept
in scheme: en-word.net
definition: seek or achieve an end by using to one's advantage
example: She uses her influential friends to get jobs
example: The president's wife used her good connections
ili: i34692
lexfile: verb.social
part of speech: verb
hypernym: 01165070-v