schoolmaster-n
type: LexicalEntry
canonical form: schoolmaster
sense: 02590248-n
part of speech: noun

Lutjanus apodus-n
type: LexicalEntry
canonical form: Lutjanus apodus
sense: 02590248-n
part of speech: noun

02590248-n
type: LexicalConcept
in scheme: en-word.net
definition: food fish of warm Caribbean and Atlantic waters
ili: i49297
lexfile: noun.animal
part of speech: noun
hypernym: 02589174-n