suborn-v
type: LexicalEntry
canonical form: suborn
sense: 02587361-v
part of speech: verb

02587361-v
type: LexicalConcept
in scheme: en-word.net
definition: incite to commit a crime or an evil deed
example: He suborned his butler to cover up the murder of his wife
ili: i34589
lexfile: verb.social
part of speech: verb
hypernym: 02585532-v