cheat-v
type: LexicalEntry
canonical form: cheat
sense: 02580591-v
part of speech: verb

chisel-v
type: LexicalEntry
canonical form: chisel
sense: 02580591-v
part of speech: verb

02580591-v
type: LexicalConcept
in scheme: en-word.net
definition: engage in deceitful behavior; practice trickery or fraud
example: Who's chiseling on the side?
ili: i34560
lexfile: verb.social
part of speech: verb
hypernym: 02581157-v