unwieldy-a
type: LexicalEntry
canonical form: unwieldy
sense: https://en-word.net/lemma/unwieldy-a#02574457-a
part of speech: adjective

unmanageable-a
type: LexicalEntry
canonical form: unmanageable
sense: https://en-word.net/lemma/unmanageable-a#02574457-a
part of speech: adjective

https://en-word.net/synset/02574457-a
type: LexicalConcept
in scheme: en-word.net
definition: difficult to use or handle or manage because of size or weight or shape
example: we set about towing the unwieldy structure into the shelter
example: almost dropped the unwieldy parcel
ili: i14225
lexfile: adj.all
part of speech: adjective
similar: 02574753-s
similar: 02575060-s