reeking-a
type: LexicalEntry
canonical form: reeking
sense: 02560627-s
part of speech: adjective

watery-a
type: LexicalEntry
canonical form: watery
sense: 02560627-s
part of speech: adjective

02560627-s
type: LexicalConcept
in scheme: en-word.net
definition: wet with secreted or exuded moisture such as sweat or tears
example: wiped his reeking neck
ili: i14145
lexfile: adj.all
part of speech: adjective satellite
similar: https://en-word.net/synset/02558087-a