abet-v
type: LexicalEntry
canonical form: abet
sense: 02554908-v
part of speech: verb

02554908-v
type: LexicalConcept
in scheme: en-word.net
definition: assist or encourage, usually in some wrongdoing
ili: i34440
lexfile: verb.social
part of speech: verb
hypernym: 02419840-v