dominate-v
type: LexicalEntry
canonical form: dominate
sense: 02545000-v
part of speech: verb

master-v
type: LexicalEntry
canonical form: master
sense: 02545000-v
part of speech: verb

02545000-v
type: LexicalConcept
in scheme: en-word.net
definition: have dominance or the power to defeat over
example: Her pain completely mastered her
example: The methods can master the problems
ili: i34397
lexfile: verb.social
part of speech: verb
hypernym: 02445887-v