out of it-a
type: LexicalEntry
canonical form: out of it
sense: 02539004-s
part of speech: adjective

02539004-s
type: LexicalConcept
in scheme: en-word.net
definition: excluded from an activity or social group
lexfile: adj.all
part of speech: adjective satellite
similar: https://en-word.net/synset/02537893-a