control-v
type: LexicalEntry
canonical form: control
sense: 02526663-v
part of speech: verb

verify-v
type: LexicalEntry
canonical form: verify
sense: 02526663-v
part of speech: verb

02526663-v
type: LexicalConcept
in scheme: en-word.net
definition: check or regulate (a scientific experiment) by conducting a parallel experiment or comparing with another standard
example: Are you controlling for the temperature?
ili: i34317
lexfile: verb.social
part of speech: verb
domain topic: 06008975-n
hypernym: 02537291-v
similar: 00664507-v