over-correct-v
type: LexicalEntry
canonical form: over-correct
sense: 02526026-v
part of speech: verb

overcompensate-v
type: LexicalEntry
canonical form: overcompensate
sense: 02526026-v
part of speech: verb

02526026-v
type: LexicalConcept
in scheme: en-word.net
definition: make excessive corrections for fear of making an error
ili: i34314
lexfile: verb.social
part of speech: verb
hypernym: 02525657-v