act up-v
type: LexicalEntry
canonical form: act up
sense: 02523321-v
part of speech: verb

carry on-v
type: LexicalEntry
canonical form: carry on
sense: 02523321-v
part of speech: verb

02523321-v
type: LexicalConcept
in scheme: en-word.net
definition: misbehave badly; act in a silly or improper way
example: The children acted up when they were not bored
ili: i34301
lexfile: verb.social
part of speech: verb
hypernym: 02522868-v