hear-v
type: LexicalEntry
canonical form: hear
sense: 02506551-v
part of speech: verb

try-v
type: LexicalEntry
canonical form: try
sense: 02506551-v
part of speech: verb

02506551-v
type: LexicalConcept
in scheme: en-word.net
definition: examine or hear (evidence or a case) by judicial process
example: The jury had heard all the evidence
example: The case will be tried in California
ili: i34223
lexfile: verb.social
part of speech: verb
hypernym: 00790226-v