appeal-v
type: LexicalEntry
canonical form: appeal
sense: 02503235-v
part of speech: verb

02503235-v
type: LexicalConcept
in scheme: en-word.net
definition: take a court case to a higher court for review
example: He was found guilty but appealed immediately
ili: i34207
lexfile: verb.social
part of speech: verb
hypernym: 00870255-v