emancipate-v
type: LexicalEntry
canonical form: emancipate
sense: 02503049-v
part of speech: verb

liberate-v
type: LexicalEntry
canonical form: liberate
sense: 02503049-v
part of speech: verb

02503049-v
type: LexicalConcept
in scheme: en-word.net
definition: give equal rights to; of women and minorities
ili: i34206
lexfile: verb.social
part of speech: verb
hypernym: 00145958-v