trap-v
type: LexicalEntry
canonical form: trap
sense: 02501834-v
part of speech: verb

pin down-v
type: LexicalEntry
canonical form: pin down
sense: 02501834-v
part of speech: verb

02501834-v
type: LexicalConcept
in scheme: en-word.net
definition: place in a confining or embarrassing position
example: He was trapped in a difficult situation
ili: i34200
lexfile: verb.social
part of speech: verb
hypernym: 02500687-v