rave-v
type: LexicalEntry
canonical form: rave
sense: 02497703-v
part of speech: verb

02497703-v
type: LexicalConcept
in scheme: en-word.net
definition: participate in an all-night techno dance party
ili: i34181
lexfile: verb.social
part of speech: verb
hypernym: 02497500-v