intermarry-v
type: LexicalEntry
canonical form: intermarry
sense: 02495739-v
part of speech: verb

02495739-v
type: LexicalConcept
in scheme: en-word.net
definition: marry within the same ethnic, social, or family group
ili: i34173
lexfile: verb.social
part of speech: verb
hypernym: 02494483-v