see-v
type: LexicalEntry
canonical form: see
sense: 02493953-v
part of speech: verb

02493953-v
type: LexicalConcept
in scheme: en-word.net
definition: go to see for professional or business reasons
example: You should see a lawyer
example: We had to see a psychiatrist
ili: i34163
lexfile: verb.social
part of speech: verb
hypernym: 02493222-v
similar: 01473299-v