meet-v
type: LexicalEntry
canonical form: meet
sense: 02492581-v
part of speech: verb

get together-v
type: LexicalEntry
canonical form: get together
sense: 02492581-v
part of speech: verb

02492581-v
type: LexicalConcept
in scheme: en-word.net
definition: get together socially or for a specific purpose
ili: i34156
lexfile: verb.social
part of speech: verb
hypernym: 02372362-v